PageRenderTime 3087ms queryFilters 0ms Sphinxql 3006ms GetByIds 47ms meta 0ms repositoryFilters 3ms languageFilters 2ms sourceFilters 0ms

3,992,007 results for 'ERROR repo:sarkutz/kick-start' (3087 ms)

Source

Language

Repository

error.php https://github.com/reechalee/joomla1.6.git | PHP | 646 lines
45		E_WARNING	=> array('mode' => 'message'),
46		E_ERROR	=> array('mode' => 'callback', 'options' => array('JError','customErrorPage'))
47	);
111	 *
112	 * @param	int		$level	The error level - use any of PHP's own error levels for this: E_ERROR, E_WARNING, E_NOTICE, E_USER_ERROR, E_USER_WARNING, E_USER_NOTICE.
113	 * @param	string	$code	The application-internal error code for this error
256		if (!is_callable(array ('JError',$function))) {
257			return JError::raiseError(E_ERROR, 'JError:'.JERROR_ILLEGAL_MODE, 'Error Handling mode is not known', 'Mode: '.$mode.' is not implemented.');
258		}
268				if (!is_array($options)) {
269					return JError::raiseError(E_ERROR, 'JError:'.JERROR_ILLEGAL_OPTIONS, 'Options for callback not valid');
270				}
281
282					return JError::raiseError(E_ERROR, 'JError:'.JERROR_CALLBACK_NOT_CALLABLE, 'Function is not callable', 'Function:'.$tmp[1].' scope '.$tmp[0].'.');
283				}
error-handler.js https://github.com/saywow/npm.git | JavaScript | 325 lines
1
2module.exports = errorHandler
3
30    }
31    log.error("not ok", "code", code)
32  }
71  var printStack = false
72  // console.error("errorHandler", er)
73  if (!npm.config.loaded) {
88  } else if (!(er instanceof Error)) {
89    log.error("weird error", er)
90    return exit(1, true)
223    })
224    log.error("peerinvalid", [er.message].concat(peerErrors).join("\n"))
225    break
Error-Codes.html https://github.com/apc-io/apc-rock-toolchain.git | HTML | 1,363 lines
7<link title="Top" rel="start" href="index.html#Top">
8<link rel="up" href="Error-Reporting.html#Error-Reporting" title="Error Reporting">
9<link rel="prev" href="Checking-for-Errors.html#Checking-for-Errors" title="Checking for Errors">
9<link rel="prev" href="Checking-for-Errors.html#Checking-for-Errors" title="Checking for Errors">
10<link rel="next" href="Error-Messages.html#Error-Messages" title="Error Messages">
11<link href="http://www.gnu.org/software/texinfo/" rel="generator-home" title="Texinfo Homepage">
52Next:&nbsp;<a rel="next" accesskey="n" href="Error-Messages.html#Error-Messages">Error Messages</a>,
53Previous:&nbsp;<a rel="previous" accesskey="p" href="Checking-for-Errors.html#Checking-for-Errors">Checking for Errors</a>,
54Up:&nbsp;<a rel="up" accesskey="u" href="Error-Reporting.html#Error-Reporting">Error Reporting</a>
109<blockquote><!-- errno 5 @c DO NOT REMOVE -->
110        <p>Input/output error; usually used for physical read or write errors. 
111</p></blockquote></div>
919        <p>The experienced user will know what is wrong. 
920<!-- This error code is a joke.  Its perror text is part of the joke. -->
921<!-- Don't change it. -->
error.cc https://github.com/Metaswitch/libmemcached-upstream.git | C++ | 624 lines
118
119  memcached_error_t *error= libmemcached_xmalloc(&memc, memcached_error_t);
120  if (error == NULL) // Bad business if this happens
163  {
164    error->size= (int)snprintf(error->message, MAX_ERROR_LENGTH, "(%lu) %.*s -> %s", 
165                               long(error->root),
194  }
195  ::write(error_log_fd, error->message, error->size);
196  ::write(error_log_fd, "\n", 1);
301{
302  assert_msg(rc != MEMCACHED_SOME_ERRORS, "Programmer error, MEMCACHED_SOME_ERRORS was about to be set on a org::libmemcached::Instance");
303  if (memcached_fatal(rc) == false)
588  memcached_error_t *error= libmemcached_xmalloc(server.root, memcached_error_t);
589  memcpy(error, server.error_messages, sizeof(memcached_error_t));
590  error->next= NULL;
Error.java https://github.com/majst01/libvirt-java.git | Java | 373 lines
7import org.libvirt.jna.NetworkPointer;
8import org.libvirt.jna.virError;
9
103    public static enum ErrorNumber {
104        VIR_ERR_OK, VIR_ERR_INTERNAL_ERROR, /* internal error */
105        VIR_ERR_NO_MEMORY, /* memory allocation failure */
114        VIR_ERR_POST_FAILED, /* a HTTP POST command to failed */
115        VIR_ERR_HTTP_ERROR, /* unexpected HTTP error code */
116        VIR_ERR_SEXPR_SERIAL, /* failure to serialize an S-Expr */
145        VIR_ERR_RPC, /* some sort of RPC error */
146        VIR_ERR_GNUTLS_ERROR, /* error from a GNUTLS call */
147        VIR_WAR_NO_NETWORK, /* failed to start network */
214
215    public Error(virError vError) {
216        code = code.wrap(vError.code);
error.hpp https://github.com/MaikKlein/oglplus.git | C++ Header | 1,298 lines
159
160/** @defgroup error_handling Error handling
161 *
1186
1187inline void HandleError(GLenum code, const ErrorInfo& info, bool assertion)
1188{
1226#if OGLPLUS_CUSTOM_ERROR_HANDLING
1227	if(aux::_has_error_handler() && aux::_get_error_handler()(
1228		ErrorData(
1268	GLenum error_code = ::glGetError(); \
1269	if(error_code != GL_NO_ERROR) HandleError(error_code, PARAM, false); \
1270}
1285	GLenum error_code = ::glGetError(); \
1286	if(error_code != GL_NO_ERROR) HandleError(error_code, PARAM, true); \
1287}
invalid-digital-signature-error-with-java.html https://github.com/kelleewitherite/kelleewitherite.github.com.git | HTML | 510 lines
88<div class="panel clearfix">
89<p><p><a target="new" href="http://java.com/en/download/help/error_1330.xml" >Error 1330: Cabinet file data1.cab has an invalid digital signature</a><br/>Error 1330. Cabinet file data1.cab has an invalid digital signature. This article   applies to: Platform(s): Windows 8, Windows 7, Vista, Windows XP, Windows   2000 .<br/><span>http://java.com/en/download/help/error_1330.xml</span></p></p>
90<a href="r-c-farm-toys.html">r c farm toys</a>
146<div class="label">
147<label for="search-terms"><p><a target="new" href="http://superuser.com/questions/230771/how-to-fix-error-1330-invalid-digital-signature-when-installing-the-rosetta-s" >windows 7 - How to fix error 1330 (invalid digital signature) when ...</a><br/>Jan 8, 2011 . Error 1330. A file that is required cannot be installed because the cabinet file [file.  cab] has an invalid digital signature. This isn&#39;t the first time I&#39;ve .<br/><span>http://superuser.com/questions/230771/how-to-fix-error-1330-invalid-digital-signature-when-installing-the-rosetta-s</span></p></label>
148<input data-search_term="" id="search-terms" maxlength="100" name="search_terms" tabindex="1" type="text" value="" />
180<a href="using-media-player-on-ipod.html">using media player on ipod</a>
181</h1><p><a target="new" href="http://www.verdiem.com/kb/error-1300-java-runtime-installation-error" >Error 1300 - Java runtime installation error | Verdiem Corporation</a><br/>Cabinet file data1.cab has an invalid digital signature. Cause. This error can be   caused by a problem with the Java installer, or a bad server connection. It is also .<br/><span>http://www.verdiem.com/kb/error-1300-java-runtime-installation-error</span></p><div class="basic-info-rating basic-info-average-rating">
182<div class="average-rating rating">
192<div class="thanks-rating tooltip right-side" style="display: none;"><div class="inner-dialog"><p><p><a target="new" href="https://issues.jboss.org/browse/PLFED-307" >[#PLFED-307] Error during validating signature on SP side when ...</a><br/>May 12, 2012 . XMLSignatureUtil.validate(XMLSignatureUtil.java:397) . ProcessingException:   PL00009: Invalid Digital Signature:Error validating signature.<br/><span>https://issues.jboss.org/browse/PLFED-307</span></p></p>
193<p><p><a target="new" href="http://texhex.blogspot.com/2010/04/java-16-update-19-failed-with-error-266.html" >Information Transmogrification: Java 1.6 Update 19 failed with Error ...</a><br/>Apr 7, 2010 . Just tried to install Java 1.6 Update 19 on a corporate Windows 7 Enterprise .   Data1.cab has an invalid digital signature (Error 266 returned by .<br/><span>http://texhex.blogspot.com/2010/04/java-16-update-19-failed-with-error-266.html</span></p></p>
194<p class="buttons">
344<div class="kicker">
345<p><p><a target="new" href="http://blogs.msdn.com/b/heaths/archive/2008/12/11/another-possible-workaround-for-error-1330.aspx" >Another Possible Workaround for Error 1330 - Heath Stewart&#39;s blog ...</a><br/>Dec 11, 2008 . When installing Visual Studio 2008, you might run into an error dialog that .   because the cabinet file D:\cab1.cab has an invalid digital signature. . MSI (s) (  54:C4) [11:00:14:659]: Validating digital signature of file &#39;D:\cab1.cab&#39; . TRUE 6)   Java offline revocation server OK (Individual) FALSE 7) Java offline .<br/><span>http://blogs.msdn.com/b/heaths/archive/2008/12/11/another-possible-workaround-for-error-1330.aspx</span></p></p>
346</div>
ping-transmit-error-code-65.html https://github.com/ucitajucega/ucitajucega.github.com.git | HTML | 714 lines
222											<p id='intelliTxt' class="intro" data-module="article-intro"><p><a target="new" href="http://mbsupport.dip.jp/mb/ping.htm" >ping ?????????????? - ??????? - MB-Support ...</a><br/>????????????????????????PING:transmit failed,error code 65  .? ???????lost=4 (100% loss)??????? ????????????????? .<br/><span>http://mbsupport.dip.jp/mb/ping.htm</span></p>
223<p><a target="new" href="http://www.corenetworkz.com/2009/05/ping-transmit-failed-error-code-65.html" >PING: transmit failed, error code 65 - ZoneAlarm effect | Internet ...</a><br/>May 12, 2009 . This article is about a usual ping request error &quot; transmit failed, error code 65&quot;.   This error mainly shown in computers where ZoneAlarm is .<br/><span>http://www.corenetworkz.com/2009/05/ping-transmit-failed-error-code-65.html</span></p><div id="relatedContentUpper" class="RelatedContent Module">
224		<header class="">
288																<div itemprop="step">
289									<p><p><a target="new" href="http://www.chicagotech.net/vista/vistaerrors.htm" >Vista Errors</a><br/>Error Code. Error 2: The system cannot find the file specified &middot; Error 404: Page   cannot be displayed ... Ping: transmit failed, error code 10050 or 65 .<br/><span>http://www.chicagotech.net/vista/vistaerrors.htm</span></p></p>								</div>
290							</div>
308									<p><p><a target="new" href="http://support.microsoft.com/kb/316414" >Ping: transmit failed, error code 65 - Microsoft Support</a><br/>Explains why you may receive a &#147;Ping: transmit failed, error code 65&#148; error   message when you try to check a network connection. Article describes a .<br/><span>http://support.microsoft.com/kb/316414</span></p>
309<p><a target="new" href="http://windowsitpro.com/windows/jsi-tip-4777-ping-transmit-failed-error-code-10050-or-code-65" >JSI Tip 4777. PING: transmit failed, error code 10050 or code 65 ...</a><br/>Feb 1, 2002 . When you issue a PING command, you may receive either of the following: PING:   transmit failed, error code 10050 PING: Transmit failed, error .<br/><span>http://windowsitpro.com/windows/jsi-tip-4777-ping-transmit-failed-error-code-10050-or-code-65</span></p></p>								</div>
310							</div>
409				<a href="jeep-enging-swap-304.html">jeep enging swap 304</a>
410									<p><p><a target="new" href="http://www.corenetworkz.com/2009/05/ping-transmit-failed-error-code-10045.html" >Ping Transmit failed, Error Code 10045 - Internet Technology Blog</a><br/>May 11, 2009 . ping; transmit failed, error code 10045 solution of the error . Ping Transmission   failed error code 31 2. . Ping Error code 65 - ZoneAlarm Effect .<br/><span>http://www.corenetworkz.com/2009/05/ping-transmit-failed-error-code-10045.html</span></p></p>
411			</li>
453				<a href="the-damage-of-hurricane-andrew.html">the damage of hurricane andrew</a>
454									<p><p><a target="new" href="http://www.rhinotek.com/PDFs/HP%20Error%20Codes.pdf" >Page 1 - () page1 HP LaserJet - COMMON ERROR CODES - Rhinotek</a><br/>EIO bad transmission. HP 2300 . Ping printer&#39;s IP address. &#149; Replace the . The   serial transmission error has occurred. &#149; The serial . Turn the printer off and then   on the clear the error codes . 65 - DEFECTIVE FORMATTER BOARD. ALL .<br/><span>http://www.rhinotek.com/PDFs/HP%20Error%20Codes.pdf</span></p></p>
455			</li>
error.py https://github.com/xiaohangyu/digsby.git | Python | 539 lines
205            if not copy:
206                raise TypeError, "ErrorNodes may only be copied"
207            self.ns=from_utf8(xmlnode_or_cond.ns.getContent())
489            if not stanza_errors.has_key(xmlnode_or_cond):
490                raise ValueError, "Bad error condition"
491
491
492        ErrorNode.__init__(self,xmlnode_or_cond,STANZA_ERROR_NS,copy=copy,parent=parent)
493
495            if error_type is None:
496                error_type=stanza_errors[xmlnode_or_cond][1]
497            self.xmlnode.setProp("type",to_utf8(error_type))
511        Use the error code provided to select the condition and the
512        <error/> CDATA for the error text."""
513        ErrorNode.upgrade(self)
windows-7-error-1068.html https://github.com/ageqynygelyx/ageqynygelyx.github.com.git | HTML | 1,786 lines
422				
423				<div class="resultAmenities">Amenities Include:<br/><p><a target="new" href="http://vtechsquadinc.wordpress.com/2012/12/04/fix-error-1068-in-windows-7/fix_window7_error/" >Fix Error 1068 in Windows 7 | vtechsquadinc</a><br/>Image navigation. Fix Error 1068 in Windows 7. Published December 4, 2012 at   210 &times; 190 in Fix Error 1068 in Windows 7 &middot; Fix Error 1068 in Windows 7 .<br/><span>http://vtechsquadinc.wordpress.com/2012/12/04/fix-error-1068-in-windows-7/fix_window7_error/</span></p></div> 
424				
631				
632				<div class="resultAmenities">Amenities Include:<br/><p><a target="new" href="http://www.vistaheads.com/forums/microsoft-public-windowsupdate/185697-re-error-0x80246008-bits-error-code-1068-a.html" >Re: Error 0x80246008 ... BITS error code: 1068 - Microsoft Windows ...</a><br/>If you have already been experiencing the error 1068 error, you can get some   help from this article error 1068 windows 7. Hope it fix your .<br/><span>http://www.vistaheads.com/forums/microsoft-public-windowsupdate/185697-re-error-0x80246008-bits-error-code-1068-a.html</span></p></div> 
633				
730			<div class="details"> 
731				<h4><a href="what-is-genetic-genealogy.html">what is genetic genealogy</a></h4><p><a target="new" href="http://www.winhelponline.com/articles/145/1/Error-1068-Error-Message-when-you-try-to-start-the-Windows-Firewall-service.html" >&quot;Error 1068&quot; Error Message when you try to start the Windows ...</a><br/>Feb 19, 2007 . &quot;Error 1068&quot; Error Message when you try to start the Windows . Error When   Clicking the Weather Gadget Hyperlink in Windows 7/Vista .<br/><span>http://www.winhelponline.com/articles/145/1/Error-1068-Error-Message-when-you-try-to-start-the-Windows-Firewall-service.html</span></p><br/> 
732				6.7 miles<br/> 
1522				
1523				<div class="resultAmenities">Amenities Include:<br/><p><a target="new" href="http://windows-exe-errors.com/error-1068-or-1075-the-dependency-service-or-group-failed-to-start/" >Error 1068 or 1075 - Windows EXE Errors</a><br/>We are going to attempt to solve your &#147;error 1068? (or the similar &#147;error 1075?)   problem right now. Error. . EXE Error Help for XP, Vista &amp; Windows 7. avatar .<br/><span>http://windows-exe-errors.com/error-1068-or-1075-the-dependency-service-or-group-failed-to-start/</span></p></div> 
1524				
1664        <div id="afActionFooter">        
1665			<div id="Accounttooltip" style="display:none;" class="afHoverboxAc"><p><a target="new" href="http://www.instant-registry-fixes.org/fix-error-1068-and-error-1083/" >Fix Error 1068 and Error 1083</a><br/>Fixing Error 1068. On your Windows XP computer, you may receive one of the   following error messages when you try to run the Internet Connection Sharing .<br/><span>http://www.instant-registry-fixes.org/fix-error-1068-and-error-1083/</span></p></div>
1666			<div style="display:none;"  class="afHoverboxFb" id="Blogtip"><p><a target="new" href="http://social.msdn.microsoft.com/Forums/en-US/windowswic/thread/6767f116-b1dd-4659-a87f-fcb4537109a6" >Windows imaging Service</a><br/>Called HP and they informed me that this is a Windows 7 issue. How do I restore   . Error 1068: The dependency service or group failed to start .<br/><span>http://social.msdn.microsoft.com/Forums/en-US/windowswic/thread/6767f116-b1dd-4659-a87f-fcb4537109a6</span></p></div>
error-handling.md https://github.com/kdh8544/libgit2.git | Unknown | 112 lines
28
29- `void giterr_set(git_error **, int, const char *, ...)`: the main function used to set an error. It allocates a new error object and stores it in the passed error pointer. It has no return value. The arguments for `giterr_set` are as follows:
30
31	- `git_error **error_ptr`: the pointer where the error will be created.
32	- `int error_class`: the class for the error. This is **not** an error code: this is an specific enum that specifies the error family. The point is to map these families 1-1 with Exception types on higher level languages (e.g. GitRepositoryException)
33	- `const char *error_str, ...`: the error string, with optional formatting arguments
36
37- `void giterr_clear(git_error **)`: clears an error previously set in an error pointer, setting it to NULL and calling `giterr_free` on it.
38
38
39- `void giterr_propagate(git_error **, git_error *)`: moves an error to a given error pointer, handling the case when the error pointer is NULL (in that case the error gets freed, because it cannot be propagated).
40
45
46For instance: A reference lookup can have an expected failure (which is when the reference cannot be found), and a critical failure (which could be any of a long list of things that could go wrong, such as the refs packfile being corrupted, a loose ref being written with the wrong permissions, etc). We cannot have distinct error codes for every single error in the library, hence `git_reference_lookup` would return GIT_SUCCESS if the operation was successful, GIT_ENOTFOUND when the reference doesn't exist, and GIT_ERROR when an error happens -- **the error is then detailed in the `git_error` parameter**.
47
error.h https://github.com/andersmalm/cyassl.git | C++ Header | 119 lines
1/* error.h
2 *
23#ifndef CTAO_CRYPT_ERROR_H
24#define CTAO_CRYPT_ERROR_H
25
33
34/* error codes */
35enum {
35enum {
36    MAX_ERROR_SZ       =  80,   /* max size of error string */
37    MAX_CODE_E         = -100,  /* errors -101 - -199 */
37    MAX_CODE_E         = -100,  /* errors -101 - -199 */
38    OPEN_RAN_E         = -101,  /* opening random device error */
39    READ_RAN_E         = -102,  /* reading random device error */
109
110CYASSL_API void CTaoCryptErrorString(int error, char* buffer);
111
error.c https://github.com/andersmalm/cyassl.git | C | 292 lines
1/* error.c
2 *
25 
26#include <cyassl/ctaocrypt/error.h>
27
33
34void CTaoCryptErrorString(int error, char* buffer)
35{
35{
36    const int max = MAX_ERROR_SZ;   /* shorthand */
37
37
38#ifdef NO_ERROR_STRINGS
39
39
40    (void)error;
41    XSTRNCPY(buffer, "no support for error strings built in", max);
c-error.c https://github.com/WoodyLin/r3.git | C | 836 lines
265**
266*/	void Set_Error_Type(ERROR_OBJ *error)
267/*
298**
299*/	REBVAL *Find_Error_Info(ERROR_OBJ *error, REBINT *num)
300/*
346	REBSER *err;		// Error object
347	ERROR_OBJ *error;	// Error object values
348	REBINT code = 0;
355//		if (!IS_INTEGER(&error->code)) {
356			if (!Find_Error_Info(error, &code)) code = RE_INVALID_ERROR;
357			SET_INTEGER(&error->code, code);
420	REBSER *err;		// Error object
421	ERROR_OBJ *error;	// Error object values
422
platform-exception-error-code-2148073494.html https://github.com/apuvajahafu/apuvajahafu.github.com.git | HTML | 2,222 lines
599   <a href="the-most-conservative-members-of-congress.html"><img src="http://lh4.ggpht.com/_MdJ0kmU9bXA/S3xido8FcII/AAAAAAAAACk/ccFaFsbvGMM/%5BUNSET%5D.jpg" border="0" alt="Word 2007 interface" title="Word 2007 interface"  width="703" height="613"/></a>
600<div class="image_caption"><p><a target="new" href="http://helpx.adobe.com/acrobat/kb/error-creation-signature-could-completed.html" >Error: &quot;Creation of this signature could not be completed. Platform ...</a><br/>Platform Exception&quot; when you sign a PDF (Acrobat 8, 9 on Windows) . Error   Code: 2148073494&quot;; &quot;Key not valid for use in specified state. Error code: .<br/><span>http://helpx.adobe.com/acrobat/kb/error-creation-signature-could-completed.html</span></p></div>
601</div> 
624
625<p><p><a target="new" href="http://helpx.adobe.com/acrobat/kb/error-creation-signature-could-completed.html" >Error: &quot;Creation of this signature could not be completed. Platform ...</a><br/>Platform Exception&quot; when you sign a PDF (Acrobat 8, 9 on Windows) . Error   Code: 2148073494&quot;; &quot;Key not valid for use in specified state. Error code: .<br/><span>http://helpx.adobe.com/acrobat/kb/error-creation-signature-could-completed.html</span></p></p>
626
975                                                            
976                                                            <dd><p><a target="new" href="http://helpx.adobe.com/acrobat/kb/error-creation-signature-could-completed.html" >Error: &quot;Creation of this signature could not be completed. Platform ...</a><br/>Platform Exception&quot; when you sign a PDF (Acrobat 8, 9 on Windows) . Error   Code: 2148073494&quot;; &quot;Key not valid for use in specified state. Error code: .<br/><span>http://helpx.adobe.com/acrobat/kb/error-creation-signature-could-completed.html</span></p></dd>
977                                                    					
1049															
1050															<dd><p><a target="new" href="http://helpx.adobe.com/acrobat/kb/error-creation-signature-could-completed.html" >Error: &quot;Creation of this signature could not be completed. Platform ...</a><br/>Platform Exception&quot; when you sign a PDF (Acrobat 8, 9 on Windows) . Error   Code: 2148073494&quot;; &quot;Key not valid for use in specified state. Error code: .<br/><span>http://helpx.adobe.com/acrobat/kb/error-creation-signature-could-completed.html</span></p><br/><p><a target="new" href="http://kb2.adobe.com/jp/cps/235/235954.html" >PDF ??????????????????????????????? ...</a><br/>2009?9?2? . Error Code: 2148073494 ?????????????? . Platform Exception&quot; when   you sign a PDF (Acrobat 8, 9 on Windows)*?TechNote .<br/><span>http://kb2.adobe.com/jp/cps/235/235954.html</span></p></dd>
1051														
1185			<option selected="selected" value="" >Job Title</option>
1186      <option title="IT Management: CIO, CTO, CSO"><p><a target="new" href="http://helpx.adobe.com/acrobat/kb/error-creation-signature-could-completed.html" >Error: &quot;Creation of this signature could not be completed. Platform ...</a><br/>Platform Exception&quot; when you sign a PDF (Acrobat 8, 9 on Windows) . Error   Code: 2148073494&quot;; &quot;Key not valid for use in specified state. Error code: .<br/><span>http://helpx.adobe.com/acrobat/kb/error-creation-signature-could-completed.html</span></p></option>
1187      <option title="IT Management: Executive VP, Senior VP"><p><a target="new" href="http://blogs.msdn.com/b/alejacma/archive/2008/12/23/cryptsignhash-fails-with-nte-bad-keyset.aspx" >CryptSignHash fails with NTE_BAD_KEYSET - Decrypt my World ...</a><br/>Dec 23, 2008 . Their signing code was based on CryptoAPI and worked just fine with some certs,   but failed with others with a NTE_BAD_KEYSET error.<br/><span>http://blogs.msdn.com/b/alejacma/archive/2008/12/23/cryptsignhash-fails-with-nte-bad-keyset.aspx</span></p></option>
error-test.out https://github.com/42i/timeflies.git | Unknown | 29 lines
1error-test.fly:2: ERROR : weird instruction "unknown-instruction ha ha ha".
2error-test.fly:3: ERROR : no current day for instruction "off 1".
2error-test.fly:3: ERROR : no current day for instruction "off 1".
3error-test.fly:5: ERROR : invalid activity work package "a.b".
4error-test.fly:6: ERROR : an activity must have a work package and a duration.
4error-test.fly:6: ERROR : an activity must have a work package and a duration.
5error-test.fly:7: ERROR : invalid activity duration "r".
6error-test.fly:8: ERROR : weird instruction "8".
6error-test.fly:8: ERROR : weird instruction "8".
7error-test.fly:8: ERROR : weird instruction "10".
8error-test.fly:9: ERROR : weird instruction "8 10".
8error-test.fly:9: ERROR : weird instruction "8 10".
9error-test.fly:10: ERROR : bad end time argument "aa" in day spec.
10error-test.fly:11: ERROR : bad start time argument "bb" in day spec.
10error-test.fly:11: ERROR : bad start time argument "bb" in day spec.
11error-test.fly:12: ERROR : unexpected day argument list: "2012-09-06 8".
12error-test.fly:12: ERROR : weird instruction "10".
error-handling.html https://github.com/tml/php-tutorial.git | HTML | 578 lines
108// call a non-existent function
109// this will generate a fatal error (E_ERROR)
110callMeJoe();
232	<p>So far we've been talking about handling errors generated by PHP itself, but why stop there? PHP allows you to use its built-in error handling system to raise your own custom errors as well.</p>
233	<p>This is accomplished via a function named trigger_error(), which allows you to raise any of the three error types reserved for users: E_USER_NOTICE, E_USER_WARNING and E_USER_ERROR. When these errors are triggered, PHP's built-in handler will automatically wake up to handle them.</p>
234	{% highlight php %}<?php
256?>{% endhighlight %}
257	<p>If you'd like to have a custom error handler to handle your custom errors... well, you're just hard to please, aren't you? Take a look at this next example, which rewrites the previous script to use a user-defined error handler:</p>
258	{% highlight php %}<?php
312	<p>If you're using PHP 5.x, you also have an alternative to the techniques discussed so far in the new Exception model (exception is Geek for error). Exceptions are new to PHP (although they've been in languages like Java and Python for ages) and they're stirring up a great deal of excitement.</p>
313	<p>In the exception-based approach, program code is wrapped in a try() block, and exceptions generated by it are "caught" and resolved by a catch() block. Multiple catch() blocks are possible, each one dealing with a different error type; this allows developers to trap different types of errors and execute appropriate exception-handling.</p>
314	<p>Here's what a typical try-catch() block looks like:</p>
326?>{% endhighlight %}
327	<p>When PHP encounters code wrapped within a try-catch() block, it first attempts to execute the code within the try() block. If this code is processed without any exceptions being generated, control transfers to the lines following the try-catch() block. However, if an exception is generated while running the code within the try() block, PHP stops execution of the block at that point and begins checking each catch() block to see if there is a handler for the exception. If a handler is found, the code within the appropriate catch() block is executed; if not, a fatal error is generated. It is even possible to handle that fatal error in a nice way using exceptions.</p>
328	<p>The exceptions themselves are generated via PHP's throw statement. The throw statement needs to be passed a descriptive message, and an optional error code. When the exception is raised, this description and code will be made available to the exception handler.</p>
error.hh https://github.com/bhesmans/click.git | C++ Header | 888 lines
104	el_critical = 2,	///< Error level for critical conditions.
105	el_error = 3,		///< Error level for normal error conditions.
106	el_warning = 4,		///< Error level for warning conditions.
147     * to static_initialize() has any effect. */
148    static ErrorHandler *static_initialize(ErrorHandler *errh);
149
597 *
598 * Use SilentErrorHandler when an ErrorHandler object is required, but error
599 * messages should not be printed. */
843     * @param landmark default landmark */
844    LandmarkErrorHandler(ErrorHandler *errh, const String &landmark);
845
873     * cause the process to exit with status 1. */
874    BailErrorHandler(ErrorHandler *errh, int level = el_error);
875
convenience-error.js https://github.com/zippo445/nodegit.git | JavaScript | 86 lines
39  var error = new git.error();
40  test.equal(error.codes.GITERR_NOMEMORY, git.raw.Error.codes.GITERR_NOMEMORY, 'GITERR_NOMEMORY code should match expected value');
41  test.equal(error.codes.GITERR_OS, git.raw.Error.codes.GITERR_OS, 'GITERR_OS code should match expected value');
41  test.equal(error.codes.GITERR_OS, git.raw.Error.codes.GITERR_OS, 'GITERR_OS code should match expected value');
42  test.equal(error.codes.GITERR_INVALID, git.raw.Error.codes.GITERR_INVALID, 'GITERR_INVALID code should match expected value');
43  test.equal(error.codes.GITERR_REFERENCE, git.raw.Error.codes.GITERR_REFERENCE, 'GITERR_REFERENCE code should match expected value');
50  test.equal(error.codes.GITERR_OBJECT, git.raw.Error.codes.GITERR_OBJECT, 'GITERR_OBJECT code should match expected value');
51  test.equal(error.codes.GITERR_NET, git.raw.Error.codes.GITERR_NET, 'GITERR_NET code should match expected value');
52  test.equal(error.codes.GITERR_TAG, git.raw.Error.codes.GITERR_TAG, 'GITERR_TAG code should match expected value');
60  test.equal(error.returnCodes.GIT_OK, git.raw.Error.returnCodes.GIT_OK, 'GIT_OK return code should match expected value');
61  test.equal(error.returnCodes.GIT_ERROR, git.raw.Error.returnCodes.GIT_ERROR, 'GIT_ERROR return code should match expected value');
62  test.equal(error.returnCodes.GIT_ENOTFOUND, git.raw.Error.returnCodes.GIT_ENOTFOUND, 'GIT_ENOTFOUND return code should match expected value');
79    repository.commit('not a proper commit sha', function(error, commit) {
80      test.notEqual(error.code, git.error.GIT_SUCCESS, 'Attempting to get commit by invalid SHA should error');
81      test.done();
error.lisp https://github.com/xlchen/gollum.git | Lisp | 53 lines
32		,@body))
33       (setf (elt *error-handlers* (position ,error-key xlib::*xerror-vector*)) #',fn-name))))
34
35;; errors in clx:
36;; access-error alloc-error atom-error closed-display colormap-error connection-failure cursor-error device-busy drawable-error font-error gcontext-error id-choice-error implementation-error length-error lookup-error match-error missing-parameter name-error pixmap-error reply-length-error reply-timeout request-error resource-error sequence-error server-disconnect unexpected-reply unknown-error value-error window-error
37(define-error-handler 'xlib:window-error (resource-id)
40      t
41      (apply #'error 'xlib:window-error :display display :error-key 'xlib:window-error key-vals)))
42
42
43(define-error-handler 'xlib:drawable-error ()
44  (dformat 1 "drawable-error received")
46      t
47      (apply #'error 'xlib:drawable-error :display display :error-key 'xlib:drawable-error key-vals)))
48
1 2 3 4 5 6 7 8 9 10 11 12 13 14 15 16 17 18 19 20 21