PageRenderTime 3059ms queryFilters 0ms Sphinxql 3006ms GetByIds 16ms meta 0ms repositoryFilters 6ms languageFilters 9ms sourceFilters 1ms

3,992,007 results for 'ERROR repo:sarkutz/kick-start' (3059 ms)

Source

Language

Repository

error.php https://github.com/t-hebert73/Personal-Website.git | PHP | 63 lines
2	/**
3	*	File : Error.php
4	*	Last Motified : Feb 20, 2012
4	*	Last Motified : Feb 20, 2012
5	*	Description : Error class definition, used for error checking.
6	*				  Requires sessions to work
7	*/
8	class Error
9	{
10		// Member variables
11		private $error;
12		//private $param;
14		// Constructor
15		// Initializes an error
16		// e - A string representing the error
error.css https://github.com/RadioOverHits/MWS-Admin.git | CSS | 60 lines
1/*
2 * MWS Admin v1.5 - Error Page Stylesheet
3 * This file is part of MWS Admin, an Admin template build for sale at ThemeForest.
10 *
11 * 1. Error Container
12 * 2. Error Code
12 * 2. Error Code
13 * 3. Error Code Typography
14 *
16 
17 /* (1) Error Container
18================================================== */
19
20div#mws-error-container
21{
user-error-errors.html.tmpl https://github.com/bayoteers/AgileTools.git | Unknown | 74 lines
8
9[%# Note that error messages should generally be indented four spaces, like
10  # below, because when Bugzilla translates an error message into plain
12  #%]
13[% IF error == "agile_team_exists" %]
14    [% title = "The team already exists" %]
16
17[% ELSIF error == "agile_missing_field" %]
18    [% title = "Field required" %]
20
21[% ELSIF error == "agile_invalid_field" %]
22    [% title = "Invalid field" %]
24
25[% ELSIF error == "agile_team_edit_not_allowed" %]
26    [% title = "Team editing denied" %]
Error.h https://github.com/LifeWanted/liblw-old.git | C++ Header | 186 lines
21
22#define LW_ERROR( ErrorClass, message )                         \
23    static_assert(                                              \
23    static_assert(                                              \
24        std::is_base_of< lw::error::Error, ErrorClass >::value, \
25        #ErrorClass " is not an LW Error."                      \
75
76inline Error::Error( void ): Error( lw::error::Code::None, "", "", "", "", 0 ){
77    // This space intentionally left blank.
123    stream 
124        << getErrorName() << " Error (" << getErrorCode() << ") [" << getFileName() << ":"
125        <<  getLineNumber() << "]: " << getMessage();
130
131inline const s64& Error::getErrorCode( void ) const LW_NOEXCEPT {
132    return m_errorCode;
error.py https://github.com/stevewilber/reddit.git | Python | 224 lines
31import random as rand
32from r2.controllers.errors import ErrorSet
33from r2.lib.filters import safemarkdown, unsafe
80
81    The ErrorDocuments middleware forwards to ErrorController when error
82    related status codes are returned from the application.
152        try:
153            c.errors = c.errors or ErrorSet()
154            # clear cookies the old fashioned way 
172            elif c.render_style == "api":
173                data = request.environ.get('extra_error_data', {'error': code})
174                c.response.content = json.dumps(data)
206    """
207    Makes sure that no errors generated in the error handler percolate
208    up to the user unless debug is enabled.
error-block-days.out https://github.com/42i/timeflies.git | Unknown | 9 lines
1error-block-days.fly:1: ERROR : no current day for instruction "leave 2012-02-05 2012-02-12 Jake".
2error-block-days.fly:2: ERROR : no current day for instruction "sick 2012-02-13 2012-02-17 Elwood".
2error-block-days.fly:2: ERROR : no current day for instruction "sick 2012-02-13 2012-02-17 Elwood".
3error-block-days.fly:4: ERROR : bad time "aaa" in instruction "off aaa".
4error-block-days.fly:5: ERROR : too many arguments in instruction "leave 2012-02-05 2012-02-12 Bilbo".
4error-block-days.fly:5: ERROR : too many arguments in instruction "leave 2012-02-05 2012-02-12 Bilbo".
5error-block-days.fly:6: ERROR : too many arguments in instruction "sick 2012-02-13 2012-02-17 Gollum".
6error-block-days.fly:7: ERROR : bad time "2012-02-18" in instruction "leave 2012-02-18".
6error-block-days.fly:7: ERROR : bad time "2012-02-18" in instruction "leave 2012-02-18".
7error-block-days.fly:8: ERROR : bad time "2012-02-19" in instruction "sick 2012-02-19".
87 errors.
Error.java https://github.com/chrbayer84/GoodData-CL.git | Java | 212 lines
1/**
2 * Error.java
3 *
16
17    public Error() {
18    }
19
20    public Error(
21            java.lang.String[] fields,
30    /**
31     * Gets the fields value for this Error.
32     *
100        if (!(obj instanceof Error)) return false;
101        Error other = (Error) obj;
102        if (obj == null) return false;
Error-Messages.html https://github.com/gueststar/Avram.git | HTML | 183 lines
15<meta name="description" content="avram - a virtual machine code interpreter: 2.7.15.3 Error Messages">
16<meta name="keywords" content="avram - a virtual machine code interpreter: 2.7.15.3 Error Messages">
17<meta name="resource-type" content="document">
43
44<a name="Error-Messages"></a>
45<table cellpadding="1" cellspacing="1" border="0">
46<tr><td valign="middle" align="left">[<a href="Operator-Generalization.html#Operator-Generalization" title="Previous section in reading order"> &lt; </a>]</td>
47<td valign="middle" align="left">[<a href="Expedient-Error-Messages.html#Expedient-Error-Messages" title="Next section in reading order"> &gt; </a>]</td>
48<td valign="middle" align="left"> &nbsp; </td>
62<a name="Error-Messages-1"></a>
63<h4 class="subsubsection">2.7.15.3 Error Messages</h4>
64
159<tr><td valign="middle" align="left">[<a href="Operator-Generalization.html#Operator-Generalization" title="Previous section in reading order"> &lt; </a>]</td>
160<td valign="middle" align="left">[<a href="Expedient-Error-Messages.html#Expedient-Error-Messages" title="Next section in reading order"> &gt; </a>]</td>
161<td valign="middle" align="left"> &nbsp; </td>
dell-optiplex-755-error-lights.html https://github.com/kubadaky/kubadaky.github.com.git | HTML | 1,160 lines
20
21<title>dell optiplex 755 error lights</title>
22
233        
234<h2 class='date-header'><p><a href="braided-hairstyles-for-black-pre-teenage-girls.html">braided hairstyles for black pre teenage girls</a><br/><p><a target="new" href="http://www.motherboards.org/forums/viewtopic.php?p=743990&amp;sid=48e380db8156be80fc64a39f2d163911" >The Mother Board :: View topic - Beep and/or Bios error codes for ...</a><br/>Where can I download a list of error codes, Optiplex 755 with a Dell A17 bios? I   couldn&#39;t find anything on Dell&#39;s site regarding this.<br/><span>http://www.motherboards.org/forums/viewtopic.php?p=743990&amp;sid=48e380db8156be80fc64a39f2d163911</span></p><br/>http://www.esquire.com/features/food-drink/best-chicken-wings</p></h2>
235
327        
328<h2 class='date-header'><p><a href="bridewell-prison-c1903.html">bridewell prison, c.1903</a><br/><p><a target="new" href="http://support.dell.com/support/edocs/systems/Op745/en/UG_en/trouble.htm" >Diagnostic Lights - Support - Dell</a><br/>Troubleshooting Tools and Utilities. Dell&#153; OptiPlex&#153; 745 User&#39;s Guide. Dell   Diagnostics. System Lights. Diagnostic Lights. Beep Codes. Error Messages .<br/><span>http://support.dell.com/support/edocs/systems/Op745/en/UG_en/trouble.htm</span></p><br/>http://deep-fried.food.com/recipe/hooters-buffalo-wings-3603</p></h2>
329
342<div class="separator" style="clear: both; text-align: center;"><a href="craftsman-lt2000-drive-belt-diagram.html" style="margin-left: 1em; margin-right: 1em;"><img border="0" height="132" src="http://mysami.com/n_desktop/dell/dell_optiplex_755_monitor_6_24_12/optiplex_755_8.jpg" width="400"></a></div><br>
343<div class="separator" style="clear: both; text-align: center;"><a href="optiplex-755-error-lights-1-and-3.html" style="margin-left: 1em; margin-right: 1em;"><img border="0" src="http://images.craigslist.org/5N95Eb5P13E83G63l9c7801b6b6f47cd71527.jpg" width="239" height="391"></a><a href="1990-alfa-5th-wheel.html" style="margin-left: 1em; margin-right: 1em;"><img border="0" src="http://i01.i.aliimg.com/photo/v0/387074721/Desktop_motherboard_for_DELL_Optiplex_320_MT.jpg" width="239" height="391"></a></div><div class="separator" style="clear: both; text-align: center;"></div>
344<div style="clear: both;"></div>
475</div>
476<div class='post-body entry-content' id='post-body-5835173787356006872'><p><a href="galeria-de-fotos-de-marleni-la-del-programa-de-don-cheto.html">galeria de fotos de marleni la del programa de don cheto</a><br/><p><a target="new" href="http://www.motherboards.org/forums/viewtopic.php?p=743990&amp;sid=48e380db8156be80fc64a39f2d163911" >The Mother Board :: View topic - Beep and/or Bios error codes for ...</a><br/>Where can I download a list of error codes, Optiplex 755 with a Dell A17 bios? I   couldn&#39;t find anything on Dell&#39;s site regarding this.<br/><span>http://www.motherboards.org/forums/viewtopic.php?p=743990&amp;sid=48e380db8156be80fc64a39f2d163911</span></p><br/>http://www.cooks.com/rec/search/0,1-00,buffalo_chicken_wings,FF.html</p><br>
477<br>
error-handling.rst https://github.com/chadcooper/argis-python-2013.git | Unknown | 131 lines
1Error handling
2==============
9
10The basics of error handling are this:
11
16   except:
17       handle error...
18   finally:
30
31   Runtime error  Traceback (most recent call last):   File "<string>", 
32   line 1, in <module>   File "c:\program files (x86)\arcgis\desktop10.1\arcpy\
32   line 1, in <module>   File "c:\program files (x86)\arcgis\desktop10.1\arcpy\
33   arcpy\analysis.py", line 687, in Buffer     raise e ExecuteError: ERROR 
34   000732: Input Features: Dataset Observer does not exist or is not supported 
107       #   sys.exc_info: 3-tuple of type, value, traceback
108       pymsg = "PYTHON ERRORS:\nTraceback info:\n" + tbinfo + "\nError Info:\n" + str(sys.exc_info()[1])
109       msgs = "ArcPy ERRORS:\n" + arcpy.GetMessages(2) + "\n"
error.rb https://github.com/sigurthor/spree-api-client.git | Ruby | 48 lines
6        # Raised when Spree returns a 4xx or 500 HTTP status code
7        class ClientError < Error
8
11          # @param error [Exception]
12          # @return [Spree::API::Client::Error::ClientError]
13          def initialize(error=nil)
13          def initialize(error=nil)
14            if error.respond_to?(:response) && !error.response.nil?
15              http_error = error.response[:status].to_i
16
17              if ERROR_MAP.has_key?(http_error)
18                raise ERROR_MAP[http_error].new(
19                  message: error.response[:body]["error"],
20                  validation_errors: error.response[:body]["errors"] || error.response[:body]["exception"])
21              else
error.t https://github.com/mickeyn/Dancer2.git | Unknown | 134 lines
37    is $e->status,  500,                                 'code';
38    is $e->title,   'Error 500 - Internal Server Error', 'title';
39    is $e->message, undef,                               'message';
52        get '/error' => sub {
53            send_error "This is a custom error message";
54        };
98        is( $r->code, 542, 'send_error sets the status to 542' );
99        like( $r->content, qr{Error 42},  'Error message looks good' );
100    };
114
115subtest 'Error with show_errors: 0' => sub {
116    my $err = Dancer2::Core::Error->new(
123
124subtest 'Error with show_errors: 1' => sub {
125    my $err = Dancer2::Core::Error->new(
error.cc https://github.com/bhesmans/click.git | C++ | 1,236 lines
60const int ErrorHandler::ok_result = 0;
61const int ErrorHandler::error_result = -EINVAL;
62
1139
1140ContextErrorHandler::ContextErrorHandler(ErrorHandler *errh, const char *fmt,
1141					 ...)
1184
1185PrefixErrorHandler::PrefixErrorHandler(ErrorHandler *errh,
1186				       const String &prefix)
1201
1202LandmarkErrorHandler::LandmarkErrorHandler(ErrorHandler *errh, const String &landmark)
1203    : ErrorVeneer(errh), _landmark(make_landmark_anno(landmark))
1219
1220BailErrorHandler::BailErrorHandler(ErrorHandler *errh, int l)
1221    : ErrorVeneer(errh), _level(l)
error.xml https://github.com/TheBigBrainsCompany/TbbcRestUtilBundle.git | XML | 25 lines
6    <parameters>
7        <parameter key="tbbc_rest_util.error.mapping.exception_mapping.class">Tbbc\RestUtil\Error\Mapping\ExceptionMapping</parameter>
8        <parameter key="tbbc_rest_util.error.mapping.exception_map.class">Tbbc\RestUtil\Error\Mapping\ExceptionMap</parameter>
8        <parameter key="tbbc_rest_util.error.mapping.exception_map.class">Tbbc\RestUtil\Error\Mapping\ExceptionMap</parameter>
9        <parameter key="tbbc_rest_util.error.error_resolver.class">Tbbc\RestUtil\Error\ErrorResolver</parameter>
10        <parameter key="tbbc_rest_util.error.default_error_factory.class">Tbbc\RestUtil\Error\DefaultErrorFactory</parameter>
13    <services>
14        <service id="tbbc_rest_util.error.mapping.exception_map" class="%tbbc_rest_util.error.mapping.exception_map.class%" />
15
15
16        <service id="tbbc_rest_util.error.error_resolver" class="%tbbc_rest_util.error.error_resolver.class%">
17            <argument type="service" id="tbbc_rest_util.error.mapping.exception_map" />
19
20        <service id="tbbc_rest_util.error.default_error_factory" class="%tbbc_rest_util.error.default_error_factory.class%">
21            <tag name="tbbc_rest_util.error_factory" />
error.go https://github.com/davdunc/etcd.git | Go | 91 lines
43	// raft related errors
44	errors[300] = "Raft Internal Error"
45	errors[301] = "During Leader Election"
60
61func NewError(errorCode int, cause string) Error {
62	return Error{
63		ErrorCode: errorCode,
64		Message:   errors[errorCode],
65		Cause:     cause,
73// Only for error interface
74func (e Error) Error() string {
75	return e.Message
85	if e.ErrorCode/100 == 3 {
86		http.Error(w, e.toJsonString(), http.StatusInternalServerError)
87	} else {
error.go git://github.com/unixdj/forego.git | Go | 95 lines
38
39func rstackError(e error) error {
40	if e == nil {
48	Errno  Errno // nature of the trap
49	Err    error // I/O error when Errno is IOError
50	PC     Cell  // program counter before the trap
72
73func (vm *VM) newErrorFull(errno Errno, err error, addr Cell) error {
74	return &Error{
88
89func (vm *VM) newError(errno Errno) error {
90	return vm.newErrorAddr(errno, 0)
92
93func (vm *VM) newIOError(e error) error {
94	return vm.newErrorFull(IOError, e, 0)
error.c https://bitbucket.org/jkniiv/ash-plan9 | C | 304 lines
1/*	$NetBSD: error.c,v 1.23 2000/07/03 03:26:19 matt Exp $	*/
2
49/*
50 * Errors and exceptions.
51 */
61#include "output.h"
62#include "error.h"
63#include "show.h"
76
77static void exverror(int, const char *, va_list)
78    __attribute__((__noreturn__));
128/*
129 * Exverror is called to raise the error exception.  If the first argument
130 * is not NULL then error prints an error message using printf style
178#endif
179	exverror(EXERROR, msg, ap);
180	/* NOTREACHED */
Error.php https://github.com/tquensen/QPMS.git | PHP | 94 lines
30            $this->view->e = $params['exception'];
31            $this->view->setFile('error/error401debug');
32        }
48            $this->view->e = $params['exception'];
49            $this->view->setFile('error/error403debug');
50        }
66            $this->view->e = $params['exception'];
67            $this->view->setFile('error/error404debug');
68        }
74            $this->registry->helper->meta->setTitle('Error '.$this->serverErrorCodes[$params['exception']->getCode()], false);
75            $this->view->message = 'Error '.$this->serverErrorCodes[$params['exception']->getCode()];
76            header($this->serverErrorCodes[$params['exception']->getCode()], true, $params['exception']->getCode());
78            $this->registry->helper->meta->setTitle('Error 500 Internal Server Error', false);
79            $this->view->message = 'Error 500 Internal Server Error';
80            header('500 Internal Server Error', true, 500);
test-stream-pipe-error-handling.js https://github.com/nexcafe/N-blog.git | JavaScript | 132 lines
78      assert.throws(function() {
79        w.emit('error', new Error('fail'));
80      });
84
85  w.on('error', myOnError);
86  r.pipe(w);
86  r.pipe(w);
87  w.removeListener('error', myOnError);
88  removed = true;
113      assert(removed);
114      w.emit('error', new Error('fail'));
115      didTest = true;
118
119  w.on('error', myOnError);
120  w._write = function() {};
seek-read-error.c https://bitbucket.org/achurch_/libnogg | C | 178 lines
93        float pcm[6];
94        vorbis_error_t error = (vorbis_error_t)-1;
95        const int num_read = vorbis_read_float(vorbis, pcm, 1, &error);
95        const int num_read = vorbis_read_float(vorbis, pcm, 1, &error);
96        if (num_read == 0 && error == VORBIS_ERROR_STREAM_END) {
97            /* The decode_frame() call in vorbis_seek() hit a read error
107        }
108        if (error != VORBIS_NO_ERROR) {
109            fprintf(stderr, "%s:%d: error was %d but should have been %d"
151    float pcm[6];
152    vorbis_error_t error = (vorbis_error_t)-1;
153    const int num_read = vorbis_read_float(vorbis, pcm, 1, &error);
158    }
159    if (error != VORBIS_NO_ERROR) {
160        fprintf(stderr, "%s:%d: error was %d but should have been %d"
1 2 3 4 5 6 7 8 9 10 11 12 13 14 15 16 17 18 19 20 21